Reaction Details
TargetCarbonic anhydrase 7
LigandBDBM10880
Substrate/Competitorn/a
Meas. Tech.ChEMBL_1465101 (CHEMBL3405433)
Ki 2.5±n/a nM
Citation Carta, FDi Cesare Mannelli, LPinard, MGhelardini, CScozzafava, AMcKenna, RSupuran, CT A class of sulfonamide carbonic anhydrase inhibitors with neuropathic pain modulating effects. Bioorg Med Chem23:1828-40 (2015) 
 
Carbonic anhydrase 7
Name:Carbonic anhydrase 7
Type:Enzyme
Mol. Mass.:29664.11
Organism:Homo sapiens (Human)
Description:Human cloned isozyme.
Residue:264
BDBM10880
NameBDBM10880
Synonyms:AZA AZM acetazolamide Acetazolamide Acetazolamide (AZA) Acetazolamide, 5 Acetazolamide, AZA CHEMBL20 Sulfonamide, 1 US11278534, Example acetazolamide sulfonamide 1
TypeSmall organic molecule
Emp. Form.C4H6N4O3S2
Mol. Mass.222.245
SMILESCC(=O)Nc1nnc(s1)S(N)(=O)=O