Reaction Details
TargetCarbonic anhydrase 9
LigandBDBM50066133
Substrate/Competitorn/a
Meas. Tech.ChEMBL_1465102 (CHEMBL3405434)
Ki 10±n/a nM
Citation Carta, FDi Cesare Mannelli, LPinard, MGhelardini, CScozzafava, AMcKenna, RSupuran, CT A class of sulfonamide carbonic anhydrase inhibitors with neuropathic pain modulating effects. Bioorg Med Chem23:1828-40 (2015) 
 
Carbonic anhydrase 9
Name:Carbonic anhydrase 9
Type:Enzyme
Mol. Mass.:49669.03
Organism:Homo sapiens (Human)
Description:Catalytic domain of human cloned isozyme was used in the assay
Residue:459
BDBM50066133
NameBDBM50066133
Synonyms:CHEMBL1338403
TypeSmall organic molecule
Emp. Form.C10H15NO3S
Mol. Mass.229.296
SMILESCCCCOc1ccc(cc1)S(N)(=O)=O