Reaction Details
TargetCarbonic anhydrase 9
LigandBDBM50066128
Substrate/Competitorn/a
Meas. Tech.ChEMBL_1465102 (CHEMBL3405434)
Ki 0.860000±n/a nM
Citation Carta, FDi Cesare Mannelli, LPinard, MGhelardini, CScozzafava, AMcKenna, RSupuran, CT A class of sulfonamide carbonic anhydrase inhibitors with neuropathic pain modulating effects. Bioorg Med Chem23:1828-40 (2015) 
 
Carbonic anhydrase 9
Name:Carbonic anhydrase 9
Type:Enzyme
Mol. Mass.:49669.03
Organism:Homo sapiens (Human)
Description:Catalytic domain of human cloned isozyme was used in the assay
Residue:459
BDBM50066128
NameBDBM50066128
Synonyms:CHEMBL3402964
TypeSmall organic molecule
Emp. Form.C13H8F5NO3S
Mol. Mass.353.265
SMILESNS(=O)(=O)c1ccc(OCc2c(F)c(F)c(F)c(F)c2F)cc1