Reaction Details
TargetCarbonic anhydrase 12
LigandBDBM50066120
Substrate/Competitorn/a
Meas. Tech.ChEMBL_1465103 (CHEMBL3405435)
Ki 6.2±n/a nM
Citation Carta, FDi Cesare Mannelli, LPinard, MGhelardini, CScozzafava, AMcKenna, RSupuran, CT A class of sulfonamide carbonic anhydrase inhibitors with neuropathic pain modulating effects. Bioorg Med Chem23:1828-40 (2015) 
 
Carbonic anhydrase 12
Name:Carbonic anhydrase 12
Type:Enzyme
Mol. Mass.:39456.00
Organism:Homo sapiens (Human)
Description:Catalytic domain of human cloned isozyme was used in the assay
Residue:354
BDBM50066120
NameBDBM50066120
Synonyms:CHEMBL3402972
TypeSmall organic molecule
Emp. Form.C16H12N2O3S2
Mol. Mass.344.408
SMILESNS(=O)(=O)c1nc2ccc(OCC#Cc3ccccc3)cc2s1