Reaction Details
TargetMetabotropic glutamate receptor 5
LigandBDBM50066362
Substrate/Competitorn/a
Meas. Tech.ChEMBL_1465792 (CHEMBL3405908)
Ki 3.3±n/a nM
Citation Nógrádi, KWágner, GDomány, GBobok, AMagdó, IKolok, SMikó-Bakk, MLVastag, MSághy, KGyertyán, IKóti, JGál, KFarkas, SKeseru, GMGreiner, ISzombathelyi, Z Thieno[2,3-b]pyridines as negative allosteric modulators of metabotropic GluR5 receptors: Lead optimization. Bioorg Med Chem Lett25:1724-9 (2015) 
 
Metabotropic glutamate receptor 5
Name:Metabotropic glutamate receptor 5
Type:Enzyme
Mol. Mass.:131900.14
Organism:Rattus norvegicus (Rat)
Description:P31424
Residue:1203
BDBM50066362
NameBDBM50066362
Synonyms:CHEMBL3401594
TypeSmall organic molecule
Emp. Form.C21H16ClNO2S2
Mol. Mass.413.94
SMILESCc1ccc(cc1C)S(=O)(=O)c1sc2ncccc2c1-c1ccc(Cl)cc1