Reaction Details
TargetMetabotropic glutamate receptor 5
LigandBDBM50066369
Substrate/Competitorn/a
Meas. Tech.ChEMBL_1465792 (CHEMBL3405908)
Ki 7.9±n/a nM
Citation Nógrádi, KWágner, GDomány, GBobok, AMagdó, IKolok, SMikó-Bakk, MLVastag, MSághy, KGyertyán, IKóti, JGál, KFarkas, SKeseru, GMGreiner, ISzombathelyi, Z Thieno[2,3-b]pyridines as negative allosteric modulators of metabotropic GluR5 receptors: Lead optimization. Bioorg Med Chem Lett25:1724-9 (2015) 
 
Metabotropic glutamate receptor 5
Name:Metabotropic glutamate receptor 5
Type:Enzyme
Mol. Mass.:131900.14
Organism:Rattus norvegicus (Rat)
Description:P31424
Residue:1203
BDBM50066369
NameBDBM50066369
Synonyms:CHEMBL3401590
TypeSmall organic molecule
Emp. Form.C20H13ClFNO3S2
Mol. Mass.433.904
SMILESCOc1ccc(cc1F)S(=O)(=O)c1sc2ncccc2c1-c1ccc(Cl)cc1