Reaction Details
TargetMetabotropic glutamate receptor 5
LigandBDBM50066516
Substrate/Competitorn/a
Meas. Tech.ChEMBL_1465792 (CHEMBL3405908)
Ki 9.1±n/a nM
Citation Nógrádi, KWágner, GDomány, GBobok, AMagdó, IKolok, SMikó-Bakk, MLVastag, MSághy, KGyertyán, IKóti, JGál, KFarkas, SKeseru, GMGreiner, ISzombathelyi, Z Thieno[2,3-b]pyridines as negative allosteric modulators of metabotropic GluR5 receptors: Lead optimization. Bioorg Med Chem Lett25:1724-9 (2015) 
 
Metabotropic glutamate receptor 5
Name:Metabotropic glutamate receptor 5
Type:Enzyme
Mol. Mass.:131900.14
Organism:Rattus norvegicus (Rat)
Description:P31424
Residue:1203
BDBM50066516
NameBDBM50066516
Synonyms:CHEMBL3401568
TypeSmall organic molecule
Emp. Form.C18H19ClN2O2S
Mol. Mass.362.874
SMILESClc1cccc(NC(=O)O\N=C2/CCCCC2Cc2cccs2)c1