Reaction Details
TargetMetabotropic glutamate receptor 5
LigandBDBM50066713
Substrate/Competitorn/a
Meas. Tech.ChEMBL_1465792 (CHEMBL3405908)
Ki 2.8±n/a nM
Citation Nógrádi, KWágner, GDomány, GBobok, AMagdó, IKolok, SMikó-Bakk, MLVastag, MSághy, KGyertyán, IKóti, JGál, KFarkas, SKeseru, GMGreiner, ISzombathelyi, Z Thieno[2,3-b]pyridines as negative allosteric modulators of metabotropic GluR5 receptors: Lead optimization. Bioorg Med Chem Lett25:1724-9 (2015) 
 
Metabotropic glutamate receptor 5
Name:Metabotropic glutamate receptor 5
Type:Enzyme
Mol. Mass.:131900.14
Organism:Rattus norvegicus (Rat)
Description:P31424
Residue:1203
BDBM50066713
NameBDBM50066713
Synonyms:CHEMBL3403145
TypeSmall organic molecule
Emp. Form.C20H9F3N2O2S2
Mol. Mass.430.423
SMILESFc1ccc(cc1)-c1c(sc2nc(F)ccc12)S(=O)(=O)c1cc(F)cc(c1)C#N