Reaction Details
TargetMetabotropic glutamate receptor 5
LigandBDBM50066736
Substrate/Competitorn/a
Meas. Tech.ChEMBL_1465792 (CHEMBL3405908)
Ki 4.2±n/a nM
Citation Nógrádi, KWágner, GDomány, GBobok, AMagdó, IKolok, SMikó-Bakk, MLVastag, MSághy, KGyertyán, IKóti, JGál, KFarkas, SKeseru, GMGreiner, ISzombathelyi, Z Thieno[2,3-b]pyridines as negative allosteric modulators of metabotropic GluR5 receptors: Lead optimization. Bioorg Med Chem Lett25:1724-9 (2015) 
 
Metabotropic glutamate receptor 5
Name:Metabotropic glutamate receptor 5
Type:Enzyme
Mol. Mass.:131900.14
Organism:Rattus norvegicus (Rat)
Description:P31424
Residue:1203
BDBM50066736
NameBDBM50066736
Synonyms:CHEMBL3403120
TypeSmall organic molecule
Emp. Form.C20H12FN3O2S2
Mol. Mass.409.457
SMILESNc1cnc2sc(c(-c3cccc(F)c3)c2c1)S(=O)(=O)c1cccc(c1)C#N