Reaction Details
TargetMetabotropic glutamate receptor 5
LigandBDBM50066525
Substrate/Competitorn/a
Meas. Tech.ChEMBL_1465792 (CHEMBL3405908)
Ki 8.9±n/a nM
Citation Nógrádi, KWágner, GDomány, GBobok, AMagdó, IKolok, SMikó-Bakk, MLVastag, MSághy, KGyertyán, IKóti, JGál, KFarkas, SKeseru, GMGreiner, ISzombathelyi, Z Thieno[2,3-b]pyridines as negative allosteric modulators of metabotropic GluR5 receptors: Lead optimization. Bioorg Med Chem Lett25:1724-9 (2015) 
 
Metabotropic glutamate receptor 5
Name:Metabotropic glutamate receptor 5
Type:Enzyme
Mol. Mass.:131900.14
Organism:Rattus norvegicus (Rat)
Description:P31424
Residue:1203
BDBM50066525
NameBDBM50066525
Synonyms:CHEMBL3403099
TypeSmall organic molecule
Emp. Form.C20H10ClFN2O2S2
Mol. Mass.428.887
SMILESFc1cc(cc(c1)S(=O)(=O)c1sc2ncccc2c1-c1cccc(Cl)c1)C#N