Reaction Details
TargetInduced myeloid leukemia cell differentiation protein Mcl-1
LigandBDBM50067460
Substrate/Competitorn/a
Meas. Tech.ChEMBL_1465279 (CHEMBL3406498)
Ki 86±n/a nM
Citation Wan, YWu, SXiao, GLiu, THou, XChen, CGuan, PYang, XFang, H Design, synthesis and preliminary bioactivity studies of 2-thioxo-4-thiazolidinone derivatives as Bcl-2 inhibitors. Bioorg Med Chem23:1994-2003 (2015) 
 
Induced myeloid leukemia cell differentiation protein Mcl-1
Name:Induced myeloid leukemia cell differentiation protein Mcl-1
Type:Membrane; Single-pass membrane protein
Mol. Mass.:37332.87
Organism:Homo sapiens (Human)
Description:Q07820
Residue:350
BDBM50067460
NameBDBM50067460
Synonyms:CHEMBL3401800
TypeSmall organic molecule
Emp. Form.C31H22BrN3O6S3
Mol. Mass.708.622
SMILES[O-][N+](=O)c1ccc(cc1)-c1ccc(\C=C2/SC(=S)N([C@@H](Cc3ccc(Br)cc3)C(=O)NS(=O)(=O)c3ccccc3)C2=O)cc1