Reaction Details
TargetReceptor-type tyrosine-protein kinase FLT3
LigandBDBM50067534
Substrate/Competitorn/a
Meas. Tech.ChEMBL_1465690 (CHEMBL3405277)
Ki 4000±n/a nM
Citation Boyd, MJBandarage, UKBennett, HByrn, RRDavies, IGu, WJacobs, MLedeboer, MWLedford, BLeeman, JRPerola, EWang, TBennani, YClark, MPCharifson, PS Isosteric replacements of the carboxylic acid of drug candidate VX-787: Effect of charge on antiviral potency and kinase activity of azaindole-based influenza PB2 inhibitors. Bioorg Med Chem Lett25:1990-4 (2015) 
 
Receptor-type tyrosine-protein kinase FLT3
Name:Receptor-type tyrosine-protein kinase FLT3
Type:Enzyme
Mol. Mass.:112888.62
Organism:Homo sapiens (Human)
Description:P36888
Residue:993
BDBM50067534
NameBDBM50067534
Synonyms:CHEMBL3401985
TypeSmall organic molecule
Emp. Form.C22H21F2N7O
Mol. Mass.437.4452
SMILESOc1cc([nH]n1)[C@H]1C2CCC(CC2)[C@@H]1Nc1nc(ncc1F)-c1c[nH]c2ncc(F)cc12