Reaction Details
TargetGlycogen synthase kinase-3
LigandBDBM50067531
Substrate/Competitorn/a
Meas. Tech.ChEMBL_1465689 (CHEMBL3405276)
Ki 85±n/a nM
Citation Boyd, MJBandarage, UKBennett, HByrn, RRDavies, IGu, WJacobs, MLedeboer, MWLedford, BLeeman, JRPerola, EWang, TBennani, YClark, MPCharifson, PS Isosteric replacements of the carboxylic acid of drug candidate VX-787: Effect of charge on antiviral potency and kinase activity of azaindole-based influenza PB2 inhibitors. Bioorg Med Chem Lett25:1990-4 (2015) 
 
Glycogen synthase kinase-3
Name:Glycogen synthase kinase-3
Synonyms:Glycogen synthase kinase-3 alpha/beta
Type:n/a
Mol. Mass.:n/a
Description:ASSAY_ID of ChEMBL is 2193535
Components:This complex has 2 components.
Component 1
Name:Glycogen synthase kinase-3 alpha
Type:Enzyme
Mol. Mass.:50991.79
Organism:Homo sapiens (Human)
Description:P49840
Residue:483
Component 2
Name:Glycogen synthase kinase-3 beta
Synonyms:GSK-3 beta GSK3B Glycogen synthase kinase 3 beta (GSK3B) Glycogen synthase kinase-3 beta (GSK-3B) Glycogen synthase kinase-3 beta (GSK3B) Glycogen synthase kinase-3beta (GSK3B) | Serine/threonine-protein kinase GSK3B
Type:Enzyme
Mol. Mass.:46756.38
Organism:Homo sapiens (Human)
Description:P49841
Residue:420
BDBM50067531
NameBDBM50067531
Synonyms:CHEMBL3401983
TypeSmall organic molecule
Emp. Form.C19H20F2N6O2S
Mol. Mass.434.463
SMILESNS(=O)(=O)[C@H]1C2CCC(CC2)[C@@H]1Nc1nc(ncc1F)-c1c[nH]c2ncc(F)cc12