Reaction Details
TargetRho-associated protein kinase 1/2
LigandBDBM50067541
Substrate/Competitorn/a
Meas. Tech.ChEMBL_1465692 (CHEMBL3405453)
Ki>4000±n/a nM
Citation Boyd, MJBandarage, UKBennett, HByrn, RRDavies, IGu, WJacobs, MLedeboer, MWLedford, BLeeman, JRPerola, EWang, TBennani, YClark, MPCharifson, PS Isosteric replacements of the carboxylic acid of drug candidate VX-787: Effect of charge on antiviral potency and kinase activity of azaindole-based influenza PB2 inhibitors. Bioorg Med Chem Lett25:1990-4 (2015) 
 
Rho-associated protein kinase 1/2
Name:Rho-associated protein kinase 1/2
Type:n/a
Mol. Mass.:n/a
Description:ASSAY_ID of EBI is 432392
Components:This complex has 2 components.
Component 1
Name:Rho-associated protein kinase 1
Synonyms:ROCK-I ROCK1_HUMAN Rho-associated protein kinase Rho-associated, coiled-coil-containing protein kinase 1 Rho-kinase (ROCK I) p160 ROCK-1 | p160ROCK
Type:Serine/threonine-protein kinase
Mol. Mass.:158156.77
Organism:Homo sapiens (Human)
Description:Q13464
Residue:1354
Component 2
Name:Rho-associated protein kinase 2
Synonyms:KIAA0619 ROCK2 Rho kinase 2 (ROCKII) Rho-associated protein kinase 2 (ROCK2) Rho-associated protein kinase 2/Transforming protein RhoA Rho-associated, coiled-coil-containing protein kinase II p164 ROCK-2
Type:Protein
Mol. Mass.:160885.43
Organism:Homo sapiens (Human)
Description:O75116
Residue:1388
Component 3
Name:Rho-associated protein kinase 2
Synonyms:KIAA0619 ROCK2 Rho kinase 2 (ROCKII) Rho-associated protein kinase 2 (ROCK2) Rho-associated protein kinase 2/Transforming protein RhoA Rho-associated, coiled-coil-containing protein kinase II p164 ROCK-2
Type:Protein
Mol. Mass.:160885.43
Organism:Homo sapiens (Human)
Description:O75116
Residue:1388
BDBM50067541
NameBDBM50067541
Synonyms:CHEMBL3401975
TypeSmall organic molecule
Emp. Form.C20H19F2N9
Mol. Mass.423.422
SMILESFc1cnc2[nH]cc(-c3ncc(F)c(N[C@H]4C5CCC(CC5)[C@@H]4c4nnn[nH]4)n3)c2c1