Reaction Details
TargetMitogen-activated protein kinase 10
LigandBDBM50067535
Substrate/Competitorn/a
Meas. Tech.ChEMBL_1465691 (CHEMBL3405452)
Ki>4000±n/a nM
Citation Boyd, MJBandarage, UKBennett, HByrn, RRDavies, IGu, WJacobs, MLedeboer, MWLedford, BLeeman, JRPerola, EWang, TBennani, YClark, MPCharifson, PS Isosteric replacements of the carboxylic acid of drug candidate VX-787: Effect of charge on antiviral potency and kinase activity of azaindole-based influenza PB2 inhibitors. Bioorg Med Chem Lett25:1990-4 (2015) 
 
Mitogen-activated protein kinase 10
Name:Mitogen-activated protein kinase 10
Type:Enzyme
Mol. Mass.:52586.89
Organism:Homo sapiens (Human)
Description:n/a
Residue:464
BDBM50067535
NameBDBM50067535
Synonyms:CHEMBL3401986
TypeSmall organic molecule
Emp. Form.C21H22F2N6O
Mol. Mass.412.4358
SMILESCNC(=O)[C@H]1C2CCC(CC2)[C@@H]1Nc1nc(ncc1F)-c1c[nH]c2ncc(F)cc12