Reaction Details
TargetProto-oncogene tyrosine-protein kinase Src
LigandBDBM50067515
Substrate/Competitorn/a
Meas. Tech.ChEMBL_1465694 (CHEMBL3405455)
Ki>4000±n/a nM
Citation Boyd, MJBandarage, UKBennett, HByrn, RRDavies, IGu, WJacobs, MLedeboer, MWLedford, BLeeman, JRPerola, EWang, TBennani, YClark, MPCharifson, PS Isosteric replacements of the carboxylic acid of drug candidate VX-787: Effect of charge on antiviral potency and kinase activity of azaindole-based influenza PB2 inhibitors. Bioorg Med Chem Lett25:1990-4 (2015) 
 
Proto-oncogene tyrosine-protein kinase Src
Name:Proto-oncogene tyrosine-protein kinase Src
Type:Protein
Mol. Mass.:59838.60
Organism:Homo sapiens (Human)
Description:P12931
Residue:536
BDBM50067515
NameBDBM50067515
Synonyms:CHEMBL3401979
TypeSmall organic molecule
Emp. Form.C22H20F2N6O2
Mol. Mass.438.43
SMILESOc1cc(no1)[C@H]1C2CCC(CC2)[C@@H]1Nc1nc(ncc1F)-c1c[nH]c2ncc(F)cc12