Reaction Details
TargetTyrosine-protein kinase SYK
LigandBDBM50067538
Substrate/Competitorn/a
Meas. Tech.ChEMBL_1465697 (CHEMBL3405458)
Ki>4000±n/a nM
Citation Boyd, MJBandarage, UKBennett, HByrn, RRDavies, IGu, WJacobs, MLedeboer, MWLedford, BLeeman, JRPerola, EWang, TBennani, YClark, MPCharifson, PS Isosteric replacements of the carboxylic acid of drug candidate VX-787: Effect of charge on antiviral potency and kinase activity of azaindole-based influenza PB2 inhibitors. Bioorg Med Chem Lett25:1990-4 (2015) 
 
Tyrosine-protein kinase SYK
Name:Tyrosine-protein kinase SYK
Type:Enzyme
Mol. Mass.:72079.99
Organism:Homo sapiens (Human)
Description:P43405
Residue:635
BDBM50067538
NameBDBM50067538
Synonyms:CHEMBL3401988
TypeSmall organic molecule
Emp. Form.C22H21F2N7O
Mol. Mass.437.4452
SMILESCc1noc(n1)[C@H]1C2CCC(CC2)[C@@H]1Nc1nc(ncc1F)-c1c[nH]c2ncc(F)cc12