Reaction Details
TargetInterleukin-1 receptor-associated kinase 4
LigandBDBM50067533
Substrate/Competitorn/a
Meas. Tech.ChEMBL_1465696 (CHEMBL3405457)
Ki 2700±n/a nM
Citation Boyd, MJBandarage, UKBennett, HByrn, RRDavies, IGu, WJacobs, MLedeboer, MWLedford, BLeeman, JRPerola, EWang, TBennani, YClark, MPCharifson, PS Isosteric replacements of the carboxylic acid of drug candidate VX-787: Effect of charge on antiviral potency and kinase activity of azaindole-based influenza PB2 inhibitors. Bioorg Med Chem Lett25:1990-4 (2015) 
 
Interleukin-1 receptor-associated kinase 4
Name:Interleukin-1 receptor-associated kinase 4
Type:Protein
Mol. Mass.:51519.08
Organism:Homo sapiens (Human)
Description:Q9NWZ3
Residue:460
BDBM50067533
NameBDBM50067533
Synonyms:CHEMBL3401984
TypeSmall organic molecule
Emp. Form.C21H23F2N5O2
Mol. Mass.415.4364
SMILES[H][C@]1(C(O)CO)C2CCC(CC2)[C@@H]1Nc1nc(ncc1F)-c1c[nH]c2ncc(F)cc12