Reaction Details
TargetSerine/threonine-protein kinase PLK1
LigandBDBM50067542
Substrate/Competitorn/a
Meas. Tech.ChEMBL_1465699 (CHEMBL3405460)
Ki>4000±n/a nM
Citation Boyd, MJBandarage, UKBennett, HByrn, RRDavies, IGu, WJacobs, MLedeboer, MWLedford, BLeeman, JRPerola, EWang, TBennani, YClark, MPCharifson, PS Isosteric replacements of the carboxylic acid of drug candidate VX-787: Effect of charge on antiviral potency and kinase activity of azaindole-based influenza PB2 inhibitors. Bioorg Med Chem Lett25:1990-4 (2015) 
 
Serine/threonine-protein kinase PLK1
Name:Serine/threonine-protein kinase PLK1
Type:Serine/threonine-protein kinase
Mol. Mass.:68277.16
Organism:Homo sapiens (Human)
Description:P53350
Residue:603
BDBM50067542
NameBDBM50067542
Synonyms:CHEMBL3401976
TypeSmall organic molecule
Emp. Form.C19H20F2N5O3P
Mol. Mass.435.3644
SMILESOP(O)(=O)[C@H]1C2CCC(CC2)[C@@H]1Nc1nc(ncc1F)-c1c[nH]c2ncc(F)cc12