Reaction Details
TargetBeta-secretase 1
LigandBDBM50400214
Substrate/Competitorn/a
Meas. Tech.ChEMBL_1466423 (CHEMBL3406368)
IC50 54±n/a nM
Citation Liu, JChen, WXu, YRen, SZhang, WLi, Y Design, synthesis and biological evaluation of tasiamide B derivatives as BACE1 inhibitors. Bioorg Med Chem23:1963-74 (2015) 
 
Beta-secretase 1
Name:Beta-secretase 1
Type:Protein
Mol. Mass.:55755.10
Organism:Homo sapiens (Human)
Description:P56817
Residue:501
BDBM50400214
NameBDBM50400214
Synonyms:CHEMBL2181022
TypeSmall organic molecule
Emp. Form.C55H76N8O12
Mol. Mass.1041.2383
SMILESCOC(=O)[C@@H]1CCCN1C(=O)[C@@H](Cc1ccccc1)N(C)C(=O)[C@H](C)NC(=O)[C@H](CC(C)C)NC(=O)C[C@H](O)[C@H](Cc1ccccc1)NC(=O)[C@H](CCC(N)=O)N(C)C(=O)[C@@H](NC(=O)OCc1ccccc1)C(C)C