Reaction Details
TargetHigh affinity cAMP-specific 3',5'-cyclic phosphodiesterase 7A
LigandBDBM50068283
Substrate/Competitorn/a
Meas. Tech.ChEMBL_1464338 (CHEMBL3404605)
IC50 1.5±n/a nM
Citation Endo, YKawai, KAsano, TAmano, SAsanuma, YSawada, KOnodera, YUeo, NTakahashi, NSonoda, YKamei, NIrie, T 2-(Isopropylamino)thieno[3,2-d]pyrimidin-4(3H)-one derivatives as selective phosphodiesterase 7 inhibitors with potent in vivo efficacy. Bioorg Med Chem Lett25:1910-4 (2015) 
 
High affinity cAMP-specific 3',5'-cyclic phosphodiesterase 7A
Name:High affinity cAMP-specific 3',5'-cyclic phosphodiesterase 7A
Type:Enzyme
Mol. Mass.:55514.96
Organism:Homo sapiens (Human)
Description:Q13946
Residue:482
BDBM50068283
NameBDBM50068283
Synonyms:CHEMBL3403371
TypeSmall organic molecule
Emp. Form.C22H26N4O2S
Mol. Mass.410.532
SMILESCCn1c(NC(C)C)nc2c(csc2c1=O)C1CCN(C1)C(=O)c1ccccc1