Reaction Details
TargetSerine protease hepsin
LigandBDBM50069107
Substrate/Competitorn/a
Meas. Tech.ChEMBL_1466699 (CHEMBL3404297)
Ki 7000±n/a nM
Citation Franco, FMJones, DEHarris, PKHan, ZWildman, SAJarvis, CMJanetka, JW Structure-based discovery of small molecule hepsin and HGFA protease inhibitors: Evaluation of potency and selectivity derived from distinct binding pockets. Bioorg Med Chem23:2328-43 (2015) 
 
Serine protease hepsin
Name:Serine protease hepsin
Type:Enzyme
Mol. Mass.:45016.98
Organism:Homo sapiens (Human)
Description:Human deglycosylated hepsin was expressed in Pichia pastoris.
Residue:417
BDBM50069107
NameBDBM50069107
Synonyms:CHEMBL356792
TypeSmall organic molecule
Emp. Form.C30H31N5O3S
Mol. Mass.541.664
SMILES[H][C@@](Cc1cccc(c1)C(N)=N)(NS(=O)(=O)c1ccc2ccccc2c1)C(=O)N1CCN(CC1)c1ccccc1