Reaction Details
TargetSerine protease hepsin
LigandBDBM50069115
Substrate/Competitorn/a
Meas. Tech.ChEMBL_1466699 (CHEMBL3404297)
Ki 48±n/a nM
Citation Franco, FMJones, DEHarris, PKHan, ZWildman, SAJarvis, CMJanetka, JW Structure-based discovery of small molecule hepsin and HGFA protease inhibitors: Evaluation of potency and selectivity derived from distinct binding pockets. Bioorg Med Chem23:2328-43 (2015) 
 
Serine protease hepsin
Name:Serine protease hepsin
Type:Enzyme
Mol. Mass.:45016.98
Organism:Homo sapiens (Human)
Description:Human deglycosylated hepsin was expressed in Pichia pastoris.
Residue:417
BDBM50069115
NameBDBM50069115
Synonyms:CHEMBL3403531
TypeSmall organic molecule
Emp. Form.C32H33BrN6O4S
Mol. Mass.677.611
SMILESNC(=N)c1cccc(C[C@H](NS(=O)(=O)c2ccc3ccccc3c2)C(=O)N2CCN(CC2)C(=O)NCc2ccc(Br)cc2)c1