Reaction Details
TargetSerine protease hepsin
LigandBDBM50069121
Substrate/Competitorn/a
Meas. Tech.ChEMBL_1466699 (CHEMBL3404297)
Ki 553±n/a nM
Citation Franco, FMJones, DEHarris, PKHan, ZWildman, SAJarvis, CMJanetka, JW Structure-based discovery of small molecule hepsin and HGFA protease inhibitors: Evaluation of potency and selectivity derived from distinct binding pockets. Bioorg Med Chem23:2328-43 (2015) 
 
Serine protease hepsin
Name:Serine protease hepsin
Type:Enzyme
Mol. Mass.:45016.98
Organism:Homo sapiens (Human)
Description:Human deglycosylated hepsin was expressed in Pichia pastoris.
Residue:417
BDBM50069121
NameBDBM50069121
Synonyms:CHEMBL3403521
TypeSmall organic molecule
Emp. Form.C24H26N6O4S
Mol. Mass.494.566
SMILESCCc1cc(cc2c(C)coc12)C(Nc1ccc(cc1)C(N)=N)C(=O)NS(=O)(=O)c1cn(C)cn1