Reaction Details
TargetSuppressor of tumorigenicity 14 protein
LigandBDBM7840
Substrate/Competitorn/a
Meas. Tech.ChEMBL_1466698 (CHEMBL3404296)
Ki 3350±n/a nM
Citation Franco, FMJones, DEHarris, PKHan, ZWildman, SAJarvis, CMJanetka, JW Structure-based discovery of small molecule hepsin and HGFA protease inhibitors: Evaluation of potency and selectivity derived from distinct binding pockets. Bioorg Med Chem23:2328-43 (2015) 
 
Suppressor of tumorigenicity 14 protein
Name:Suppressor of tumorigenicity 14 protein
Type:Single-pass type II membrane protein
Mol. Mass.:94769.23
Organism:Homo sapiens (Human)
Description:Q9Y5Y6
Residue:855
BDBM7840
NameBDBM7840
Synonyms:RIVAROXABAN US8822458, 97
Typen/a
Emp. Form.C19H18ClN3O5S
Mol. Mass.435.881
SMILESClc1ccc(s1)C(=O)NC[C@H]1CN(C(=O)O1)c1ccc(cc1)N1CCOCC1=O