Reaction Details
TargetSuppressor of tumorigenicity 14 protein
LigandBDBM50069114
Substrate/Competitorn/a
Meas. Tech.ChEMBL_1466698 (CHEMBL3404296)
Ki 480±n/a nM
Citation Franco, FMJones, DEHarris, PKHan, ZWildman, SAJarvis, CMJanetka, JW Structure-based discovery of small molecule hepsin and HGFA protease inhibitors: Evaluation of potency and selectivity derived from distinct binding pockets. Bioorg Med Chem23:2328-43 (2015) 
 
Suppressor of tumorigenicity 14 protein
Name:Suppressor of tumorigenicity 14 protein
Type:Single-pass type II membrane protein
Mol. Mass.:94769.23
Organism:Homo sapiens (Human)
Description:Q9Y5Y6
Residue:855
BDBM50069114
NameBDBM50069114
Synonyms:CHEMBL3403532
TypeSmall organic molecule
Emp. Form.C28H32N4O3S
Mol. Mass.504.644
SMILESCc1ccc(cc1)S(=O)(=O)N[C@@H](Cc1cccc(c1)C(N)=N)C(=O)N1CCC(CC1)c1ccccc1