Reaction Details
TargetHepatocyte growth factor activator
LigandBDBM50069114
Substrate/Competitorn/a
Meas. Tech.ChEMBL_1466697 (CHEMBL3404295)
Ki 20000±n/a nM
Citation Franco, FMJones, DEHarris, PKHan, ZWildman, SAJarvis, CMJanetka, JW Structure-based discovery of small molecule hepsin and HGFA protease inhibitors: Evaluation of potency and selectivity derived from distinct binding pockets. Bioorg Med Chem23:2328-43 (2015) 
 
Hepatocyte growth factor activator
Name:Hepatocyte growth factor activator
Type:PROTEIN
Mol. Mass.:70690.18
Organism:Homo sapiens (Human)
Description:ChEMBL_109514
Residue:655
BDBM50069114
NameBDBM50069114
Synonyms:CHEMBL3403532
TypeSmall organic molecule
Emp. Form.C28H32N4O3S
Mol. Mass.504.644
SMILESCc1ccc(cc1)S(=O)(=O)N[C@@H](Cc1cccc(c1)C(N)=N)C(=O)N1CCC(CC1)c1ccccc1