Reaction Details
TargetHepatocyte growth factor activator
LigandBDBM50069127
Substrate/Competitorn/a
Meas. Tech.ChEMBL_1466696 (CHEMBL3404294)
IC50 600±n/a nM
Citation Franco, FMJones, DEHarris, PKHan, ZWildman, SAJarvis, CMJanetka, JW Structure-based discovery of small molecule hepsin and HGFA protease inhibitors: Evaluation of potency and selectivity derived from distinct binding pockets. Bioorg Med Chem23:2328-43 (2015) 
 
Hepatocyte growth factor activator
Name:Hepatocyte growth factor activator
Type:PROTEIN
Mol. Mass.:70690.18
Organism:Homo sapiens (Human)
Description:ChEMBL_109514
Residue:655
BDBM50069127
NameBDBM50069127
Synonyms:CHEMBL3403525
TypeSmall organic molecule
Emp. Form.C20H17N3O4
Mol. Mass.363.3667
SMILESCOC(=O)c1ccc2cc(OC(=O)c3ccc(NC(N)=N)cc3)ccc2c1