Reaction Details
TargetHepatocyte growth factor activator
LigandBDBM50069133
Substrate/Competitorn/a
Meas. Tech.ChEMBL_1466696 (CHEMBL3404294)
IC50 1100±n/a nM
Citation Franco, FMJones, DEHarris, PKHan, ZWildman, SAJarvis, CMJanetka, JW Structure-based discovery of small molecule hepsin and HGFA protease inhibitors: Evaluation of potency and selectivity derived from distinct binding pockets. Bioorg Med Chem23:2328-43 (2015) 
 
Hepatocyte growth factor activator
Name:Hepatocyte growth factor activator
Type:PROTEIN
Mol. Mass.:70690.18
Organism:Homo sapiens (Human)
Description:ChEMBL_109514
Residue:655
BDBM50069133
NameBDBM50069133
Synonyms:CHEMBL1195245
TypeSmall organic molecule
Emp. Form.C16H15N3O4
Mol. Mass.313.308
SMILESCOC(=O)c1ccc(OC(=O)c2ccc(NC(N)=N)cc2)cc1