Reaction Details
TargetHepatocyte growth factor activator
LigandBDBM50069122
Substrate/Competitorn/a
Meas. Tech.ChEMBL_1466697 (CHEMBL3404295)
Ki 22200±n/a nM
Citation Franco, FMJones, DEHarris, PKHan, ZWildman, SAJarvis, CMJanetka, JW Structure-based discovery of small molecule hepsin and HGFA protease inhibitors: Evaluation of potency and selectivity derived from distinct binding pockets. Bioorg Med Chem23:2328-43 (2015) 
 
Hepatocyte growth factor activator
Name:Hepatocyte growth factor activator
Type:PROTEIN
Mol. Mass.:70690.18
Organism:Homo sapiens (Human)
Description:ChEMBL_109514
Residue:655
BDBM50069122
NameBDBM50069122
Synonyms:CHEMBL3402440
TypeSmall organic molecule
Emp. Form.C35H47N5O3S
Mol. Mass.617.844
SMILESCC(C)c1cc(C(C)C)c(c(c1)C(C)C)S(=O)(=O)N[C@@H](Cc1cccc(c1)C(N)=N)C(=O)N1CCN(CC1)c1ccccc1