Reaction Details
TargetTyrosine-protein kinase JAK2
LigandBDBM50069366
Substrate/Competitorn/a
Meas. Tech.ChEMBL_1466708 (CHEMBL3404501)
IC50 3.0±n/a nM
Citation Brasca, MGGnocchi, PNesi, MAmboldi, NAvanzi, NBertrand, JBindi, SCanevari, GCasero, DCiomei, MColombo, NCribioli, SFachin, GFelder, ERGalvani, AIsacchi, AMotto, IPanzeri, ADonati, D Novel pyrrole carboxamide inhibitors of JAK2 as potential treatment of myeloproliferative disorders. Bioorg Med Chem23:2387-407 (2015) 
 
Tyrosine-protein kinase JAK2
Name:Tyrosine-protein kinase JAK2
Type:Protein
Mol. Mass.:130684.68
Organism:Homo sapiens (Human)
Description:O60674
Residue:1132
BDBM50069366
NameBDBM50069366
Synonyms:CHEMBL3403553
TypeSmall organic molecule
Emp. Form.C19H16ClN5O
Mol. Mass.365.816
SMILESCCc1ccc(Cl)cc1-c1cc([nH]c1C(N)=O)-c1ncnc2[nH]ccc12