Reaction Details
TargetScavenger receptor class B member 1
LigandBDBM50069697
Substrate/Competitorn/a
Meas. Tech.ChEMBL_1466967 (CHEMBL3406606)
IC50 250±n/a nM
Citation Dockendorff, CFaloon, PWPu, JYu, MJohnston, SBennion, MPenman, MNieland, TJDandapani, SPerez, JRMunoz, BPalmer, MASchreiber, SLKrieger, M Benzo-fused lactams from a diversity-oriented synthesis (DOS) library as inhibitors of scavenger receptor BI (SR-BI)-mediated lipid uptake. Bioorg Med Chem Lett25:2100-5 (2015) 
 
Scavenger receptor class B member 1
Name:Scavenger receptor class B member 1
Type:PROTEIN
Mol. Mass.:56761.39
Organism:Mus musculus
Description:ChEMBL_103999
Residue:509
BDBM50069697
NameBDBM50069697
Synonyms:CHEMBL2356172
TypeSmall organic molecule
Emp. Form.C26H35ClN4O6S
Mol. Mass.567.097
SMILESCC(C)NC(=O)Nc1ccc2O[C@@H](CN(C)S(=O)(=O)c3ccc(Cl)cc3)[C@H](C)CN([C@H](C)CO)C(=O)c2c1