Reaction Details
TargetPlatelet-derived growth factor receptor beta
LigandBDBM50026612
Substrate/Competitorn/a
Meas. Tech.ChEMBL_1470004 (CHEMBL3411889)
IC50 65±n/a nM
Citation Roth, GJBinder, RColbatzky, FDallinger, CSchlenker-Herceg, RHilberg, FWollin, SLKaiser, R Nintedanib: from discovery to the clinic. J Med Chem58:1053-63 (2015) 
 
Platelet-derived growth factor receptor beta
Name:Platelet-derived growth factor receptor beta
Type:Enzyme
Mol. Mass.:123922.25
Organism:Homo sapiens (Human)
Description:P09619
Residue:1106
BDBM50026612
NameBDBM50026612
Synonyms:BIBF-1120 US10981896, Compound Nintedanib US11208381, Nintedanib | Vargatef
TypeSmall organic molecule
Emp. Form.C31H33N5O4
Mol. Mass.539.6248
SMILESCOC(=O)c1ccc2\C(=C(\Nc3ccc(cc3)N(C)C(=O)CN3CCN(C)CC3)c3ccccc3)C(=O)Nc2c1