Reaction Details
TargetNischarin
LigandBDBM50070373
Substrate/Competitorn/a
Meas. Tech.ChEMBL_1467221 (CHEMBL3411418)
Ki 19±n/a nM
Citation Gasparik, VGreney, HSchann, SFeldman, JFellmann, LEhrhardt, JDBousquet, P Synthesis and biological evaluation of 2-aryliminopyrrolidines as selective ligands for I1 imidazoline receptors: discovery of new sympatho-inhibitory hypotensive agents with potential beneficial effects in metabolic syndrome. J Med Chem58:878-87 (2015) 
 
Nischarin
Name:Nischarin
Type:Enzyme Catalytic Domain
Mol. Mass.:166460.59
Organism:RAT
Description:Q4G017
Residue:1502
BDBM50070373
NameBDBM50070373
Synonyms:CHEMBL3408292
TypeSmall organic molecule
Emp. Form.C14H19ClN2
Mol. Mass.250.767
SMILESCl.CC1CN\C(C1)=N/c1cccc2CCCc12