Reaction Details
TargeteIF-2-alpha kinase GCN2
LigandBDBM50071957
Substrate/Competitorn/a
Meas. Tech.ChEMBL_1467741 (CHEMBL3412167)
IC50 12±n/a nM
Citation Smith, ALAndrews, KLBeckmann, HBellon, SFBeltran, PJBooker, SChen, HChung, YAD'Angelo, NDDao, JDellamaggiore, KRJaeckel, PKendall, RLabitzke, KLong, AMMaterna-Reichelt, SMitchell, PNorman, MHPowers, DRose, MShaffer, PLWu, MMLipford, JR Discovery of 1H-pyrazol-3(2H)-ones as potent and selective inhibitors of protein kinase R-like endoplasmic reticulum kinase (PERK). J Med Chem58:1426-41 (2015) 
 
eIF-2-alpha kinase GCN2
Name:eIF-2-alpha kinase GCN2
Type:PROTEIN
Mol. Mass.:186899.26
Organism:Homo sapiens (Human)
Description:ChEMBL_1495738
Residue:1649
BDBM50071957
NameBDBM50071957
Synonyms:CHEMBL3407850
TypeSmall organic molecule
Emp. Form.C32H26N6O3
Mol. Mass.542.5872
SMILESCNc1ncc2ccc(Oc3cc(ccc3N)C(=O)c3c(-c4ccccc4)n(C)n(-c4ccccc4)c3=O)cc2n1