Reaction Details
TargeteIF-2-alpha kinase GCN2
LigandBDBM50072032
Substrate/Competitorn/a
Meas. Tech.ChEMBL_1467741 (CHEMBL3412167)
IC50 100±n/a nM
Citation Smith, ALAndrews, KLBeckmann, HBellon, SFBeltran, PJBooker, SChen, HChung, YAD'Angelo, NDDao, JDellamaggiore, KRJaeckel, PKendall, RLabitzke, KLong, AMMaterna-Reichelt, SMitchell, PNorman, MHPowers, DRose, MShaffer, PLWu, MMLipford, JR Discovery of 1H-pyrazol-3(2H)-ones as potent and selective inhibitors of protein kinase R-like endoplasmic reticulum kinase (PERK). J Med Chem58:1426-41 (2015) 
 
eIF-2-alpha kinase GCN2
Name:eIF-2-alpha kinase GCN2
Type:PROTEIN
Mol. Mass.:186899.26
Organism:Homo sapiens (Human)
Description:ChEMBL_1495738
Residue:1649
BDBM50072032
NameBDBM50072032
Synonyms:CHEMBL3407858
TypeSmall organic molecule
Emp. Form.C31H25N5O2S
Mol. Mass.531.628
SMILESCc1ccc(C(=O)c2c(-c3ccccc3)n(C)n(-c3ccccc3)c2=O)c(N)c1-c1ccc2nc(N)sc2c1