Reaction Details
TargeteIF-2-alpha kinase GCN2
LigandBDBM50072034
Substrate/Competitorn/a
Meas. Tech.ChEMBL_1467741 (CHEMBL3412167)
IC50 610±n/a nM
Citation Smith, ALAndrews, KLBeckmann, HBellon, SFBeltran, PJBooker, SChen, HChung, YAD'Angelo, NDDao, JDellamaggiore, KRJaeckel, PKendall, RLabitzke, KLong, AMMaterna-Reichelt, SMitchell, PNorman, MHPowers, DRose, MShaffer, PLWu, MMLipford, JR Discovery of 1H-pyrazol-3(2H)-ones as potent and selective inhibitors of protein kinase R-like endoplasmic reticulum kinase (PERK). J Med Chem58:1426-41 (2015) 
 
eIF-2-alpha kinase GCN2
Name:eIF-2-alpha kinase GCN2
Type:PROTEIN
Mol. Mass.:186899.26
Organism:Homo sapiens (Human)
Description:ChEMBL_1495738
Residue:1649
BDBM50072034
NameBDBM50072034
Synonyms:CHEMBL3407860
TypeSmall organic molecule
Emp. Form.C32H24F2N4O2S
Mol. Mass.566.62
SMILESCc1ccc(C(=O)c2c(-c3ccccc3)n(C)n(-c3ccccc3)c2=O)c(N)c1-c1ccc2nc(sc2c1)C(F)F