Reaction Details
Target4-hydroxyphenylpyruvate dioxygenase
LigandBDBM50072267
Substrate/Competitorn/a
Meas. Tech.ChEMBL_1468440 (CHEMBL3412604)
IC50 150±n/a nM
Citation Xu, YLLin, HYRuan, XYang, SGHao, GFYang, WCYang, GF Synthesis and bioevaluation of pyrazole-benzimidazolone hybrids as novel human 4-Hydroxyphenylpyruvate dioxygenase inhibitors. Eur J Med Chem92:427-38 (2015) 
 
4-hydroxyphenylpyruvate dioxygenase
Name:4-hydroxyphenylpyruvate dioxygenase
Type:PROTEIN
Mol. Mass.:44937.33
Organism:Homo sapiens (Human)
Description:ChEMBL_123
Residue:393
BDBM50072267
NameBDBM50072267
Synonyms:CHEMBL3408322
TypeSmall organic molecule
Emp. Form.C18H22N4O3
Mol. Mass.342.3923
SMILESCCn1c2ccc(cc2n(c1=O)C(C)(C)C)C(=O)c1cnn(C)c1O