Reaction Details
TargetKappa-type opioid receptor
LigandBDBM50072333
Substrate/Competitorn/a
Meas. Tech.ChEMBL_1469045 (CHEMBL3413015)
Ki 130±n/a nM
Citation Iyer, MRRothman, RBDersch, CMJacobson, AERice, KC Probes for narcotic receptor mediated phenomena 49. N-substituted rac-cis-4a-arylalkyl-1,2,3,4,4a,9a-hexahydrobenzofuro[2,3-c]pyridin-6-ols. Eur J Med Chem92:531-9 (2015) 
 
Kappa-type opioid receptor
Name:Kappa-type opioid receptor
Type:G Protein-Coupled Receptor (GPCR)
Mol. Mass.:42648.76
Organism:Homo sapiens (Human)
Description:P41145
Residue:380
BDBM50072333
NameBDBM50072333
Synonyms:CHEMBL3409119
TypeSmall organic molecule
Emp. Form.C30H34FNO2
Mol. Mass.459.5949
SMILES[H][C@]12CN(CCc3ccc(F)cc3)CC[C@@]1(CCCCCc1ccccc1)c1cc(O)ccc1O2