Reaction Details
TargetCannabinoid receptor 1
LigandBDBM50072350
Substrate/Competitorn/a
Meas. Tech.ChEMBL_1469191 (CHEMBL3413747)
Ki>10000±n/a nM
Citation Slavik, RHerde, AMBieri, DWeber, MSchibli, RKrämer, SDAmetamey, SMMu, L Synthesis, radiolabeling and evaluation of novel 4-oxo-quinoline derivatives as PET tracers for imaging cannabinoid type 2 receptor. Eur J Med Chem92:554-64 (2015) 
 
Cannabinoid receptor 1
Name:Cannabinoid receptor 1
Type:G Protein-Coupled Receptor (GPCR)
Mol. Mass.:52868.96
Organism:Homo sapiens (Human)
Description:P21554
Residue:472
BDBM50072350
NameBDBM50072350
Synonyms:CHEMBL3409320
TypeSmall organic molecule
Emp. Form.C25H32N2O5
Mol. Mass.440.532
SMILESCCOCCn1cc(C(=O)NC23CC4CC(CC(O)(C4)C2)C3)c(=O)c2cccc(OC)c12