Reaction Details
TargetTransient receptor potential cation channel subfamily V member 1
LigandBDBM50073153
Substrate/Competitorn/a
Meas. Tech.ChEMBL_1468885 (CHEMBL3412242)
Ki 1.3±n/a nM
Citation Ryu, HSeo, SLee, JYHa, THLee, SJung, AAnn, JKim, SEYoon, SHong, MBlumberg, PMFrank-Foltyn, RBahrenberg, GSchiene, KStockhausen, HChristoph, TFrormann, SLee, J Pyridine C-region analogs of 2-(3-fluoro-4-methylsulfonylaminophenyl)propanamides as potent TRPV1 antagonists. Eur J Med Chem93:101-8 (2015) 
 
Transient receptor potential cation channel subfamily V member 1
Name:Transient receptor potential cation channel subfamily V member 1
Type:Protein
Mol. Mass.:94960.75
Organism:Homo sapiens (Human)
Description:Q8NER1
Residue:839
BDBM50073153
NameBDBM50073153
Synonyms:CHEMBL3407756
TypeSmall organic molecule
Emp. Form.C22H26ClF3N4O3S
Mol. Mass.518.98
SMILESCC(C(=O)NCc1ccc(nc1N1CCCCC1)C(F)(F)Cl)c1ccc(NS(C)(=O)=O)c(F)c1