Reaction Details
TargetCytochrome P450 3A4
LigandBDBM50073555
Substrate/Competitorn/a
Meas. Tech.ChEMBL_1467194 (CHEMBL3411391)
IC50 2800±n/a nM
Citation Sampson, PBLiu, YForrest, BCumming, GLi, SWPatel, NKEdwards, LLaufer, RFeher, MBan, FAwrey, DEMao, GPlotnikova, OHodgson, RBeletskaya, IMason, JMLuo, XNadeem, VWei, XKiarash, RMadeira, BHuang, PMak, TWPan, GPauls, HW The discovery of Polo-like kinase 4 inhibitors: identification of (1R,2S).2-(3-((E).4-(((cis).2,6-dimethylmorpholino)methyl)styryl). 1H.indazol-6-yl)-5'-methoxyspiro[cyclopropane-1,3'-indolin]-2'-one (CFI-400945) as a potent, orally active antitumor agent. J Med Chem58:147-69 (2015) 
 
Cytochrome P450 3A4
Name:Cytochrome P450 3A4
Type:Enzyme
Mol. Mass.:57349.57
Organism:Homo sapiens (Human)
Description:n/a
Residue:503
BDBM50073555
NameBDBM50073555
Synonyms:CHEMBL3408941 US9907800, Example A92
TypeSmall organic molecule
Emp. Form.C29H27N5O
Mol. Mass.461.5576
SMILESO=C1Nc2ccccc2[C@]11C[C@H]1c1ccc2c(\C=C\c3ccc(cc3)N3CCNCC3)n[nH]c2c1