Reaction Details
TargetSerine/threonine-protein kinase PLK4
LigandBDBM50044662
Substrate/Competitorn/a
Meas. Tech.ChEMBL_1467184 (CHEMBL3411381)
IC50 0.900000±n/a nM
Citation Sampson, PBLiu, YForrest, BCumming, GLi, SWPatel, NKEdwards, LLaufer, RFeher, MBan, FAwrey, DEMao, GPlotnikova, OHodgson, RBeletskaya, IMason, JMLuo, XNadeem, VWei, XKiarash, RMadeira, BHuang, PMak, TWPan, GPauls, HW The discovery of Polo-like kinase 4 inhibitors: identification of (1R,2S).2-(3-((E).4-(((cis).2,6-dimethylmorpholino)methyl)styryl). 1H.indazol-6-yl)-5'-methoxyspiro[cyclopropane-1,3'-indolin]-2'-one (CFI-400945) as a potent, orally active antitumor agent. J Med Chem58:147-69 (2015) 
 
Serine/threonine-protein kinase PLK4
Name:Serine/threonine-protein kinase PLK4
Type:PROTEIN
Mol. Mass.:108996.91
Organism:Homo sapiens (Human)
Description:ChEMBL_1474078
Residue:970
BDBM50044662
NameBDBM50044662
Synonyms:CHEMBL3353361 US9907800, Example A61
TypeSmall organic molecule
Emp. Form.C30H28N4O
Mol. Mass.460.5695
SMILESO=C1Nc2ccccc2[C@]11C[C@H]1c1ccc2c(\C=C\c3ccc(CN4CCCC4)cc3)n[nH]c2c1