Reaction Details
TargetAmine oxidase [flavin-containing] B
LigandBDBM50240772
Substrate/Competitorn/a
Meas. Tech.ChEMBL_1473015 (CHEMBL3420665)
IC50 6210±n/a nM
Citation Ma, LYZheng, YCWang, SQWang, BWang, ZRPang, LPZhang, MWang, JWDing, LLi, JWang, CHu, BLiu, YZhang, XDWang, JJWang, ZJZhao, WLiu, HM Design, synthesis, and structure-activity relationship of novel LSD1 inhibitors based on pyrimidine-thiourea hybrids as potent, orally active antitumor agents. J Med Chem58:1705-16 (2015) 
 
Amine oxidase [flavin-containing] B
Name:Amine oxidase [flavin-containing] B
Type:Protein
Mol. Mass.:58768.76
Organism:Homo sapiens (Human)
Description:P27338
Residue:520
BDBM50240772
NameBDBM50240772
Synonyms:(1R,2S)-(-)-2-phenylcyclopropylamine (tranylcypromine)2-Phenyl-cyclopropylamine CHEMBL1179 TRANYLCYPROMINE US10836743, Compound TCP US9180183, Tranylcypromine rel-Tranylcypromine
TypeSmall organic molecule
Emp. Form.C9H11N
Mol. Mass.133.1903
SMILESN[C@@H]1C[C@H]1c1ccccc1