Reaction Details
TargetLysine-specific histone demethylase 1A
LigandBDBM50075474
Substrate/Competitorn/a
Meas. Tech.ChEMBL_1473012 (CHEMBL3420662)
IC50 650±n/a nM
Citation Ma, LYZheng, YCWang, SQWang, BWang, ZRPang, LPZhang, MWang, JWDing, LLi, JWang, CHu, BLiu, YZhang, XDWang, JJWang, ZJZhao, WLiu, HM Design, synthesis, and structure-activity relationship of novel LSD1 inhibitors based on pyrimidine-thiourea hybrids as potent, orally active antitumor agents. J Med Chem58:1705-16 (2015) 
 
Lysine-specific histone demethylase 1A
Name:Lysine-specific histone demethylase 1A
Type:Enzyme
Mol. Mass.:92901.01
Organism:Homo sapiens (Human)
Description:O60341
Residue:852
BDBM50075474
NameBDBM50075474
Synonyms:CHEMBL3415352
TypeSmall organic molecule
Emp. Form.C18H18N6O3S2
Mol. Mass.430.504
SMILESCOc1cc(cc(OC)c1OC)-c1nc(SCC#C)nc(NNC(N)=S)c1C#N