Reaction Details
TargetAldehyde dehydrogenase 1A1
LigandBDBM50076502
Substrate/Competitorn/a
Meas. Tech.ChEMBL_1473980 (CHEMBL3419576)
IC50 5200±n/a nM
Citation Morgan, CAHurley, TD Characterization of two distinct structural classes of selective aldehyde dehydrogenase 1A1 inhibitors. J Med Chem58:1964-75 (2015) 
 
Aldehyde dehydrogenase 1A1
Name:Aldehyde dehydrogenase 1A1
Type:Protein
Mol. Mass.:54862.21
Organism:Homo sapiens (Human)
Description:n/a
Residue:501
BDBM50076502
NameBDBM50076502
Synonyms:CHEMBL1524501
TypeSmall organic molecule
Emp. Form.C19H22N4O5
Mol. Mass.386.4018
SMILESCCCCn1c(Oc2ccc(cc2)C(=O)OC)nc2n(C)c(=O)n(C)c(=O)c12