Reaction Details
TargetAldehyde dehydrogenase 1A1
LigandBDBM50076544
Substrate/Competitorn/a
Meas. Tech.ChEMBL_1473980 (CHEMBL3419576)
IC50>20000±n/a nM
Citation Morgan, CAHurley, TD Characterization of two distinct structural classes of selective aldehyde dehydrogenase 1A1 inhibitors. J Med Chem58:1964-75 (2015) 
 
Aldehyde dehydrogenase 1A1
Name:Aldehyde dehydrogenase 1A1
Type:Protein
Mol. Mass.:54862.21
Organism:Homo sapiens (Human)
Description:n/a
Residue:501
BDBM50076544
NameBDBM50076544
Synonyms:CHEMBL3416553
TypeSmall organic molecule
Emp. Form.C23H32N6O3
Mol. Mass.440.5386
SMILESCCCCn1c(CN2CCN(CC2)c2ccc(OC)cc2)nc2n(C)c(=O)n(C)c(=O)c12