Reaction Details
TargetAldehyde dehydrogenase 1A1
LigandBDBM50076555
Substrate/Competitorn/a
Meas. Tech.ChEMBL_1473980 (CHEMBL3419576)
IC50 240±n/a nM
Citation Morgan, CAHurley, TD Characterization of two distinct structural classes of selective aldehyde dehydrogenase 1A1 inhibitors. J Med Chem58:1964-75 (2015) 
 
Aldehyde dehydrogenase 1A1
Name:Aldehyde dehydrogenase 1A1
Type:Protein
Mol. Mass.:54862.21
Organism:Homo sapiens (Human)
Description:n/a
Residue:501
BDBM50076555
NameBDBM50076555
Synonyms:CHEMBL3416557
TypeSmall organic molecule
Emp. Form.C25H28N6O4
Mol. Mass.476.5276
SMILESCc1cccc(Cn2c(CN3CCN(CC3)C(=O)c3ccco3)nc3n(C)c(=O)n(C)c(=O)c23)c1