Reaction Details
TargetAldehyde dehydrogenase 1A1
LigandBDBM50076719
Substrate/Competitorn/a
Meas. Tech.ChEMBL_1473980 (CHEMBL3419576)
IC50 6100±n/a nM
Citation Morgan, CAHurley, TD Characterization of two distinct structural classes of selective aldehyde dehydrogenase 1A1 inhibitors. J Med Chem58:1964-75 (2015) 
 
Aldehyde dehydrogenase 1A1
Name:Aldehyde dehydrogenase 1A1
Type:Protein
Mol. Mass.:54862.21
Organism:Homo sapiens (Human)
Description:n/a
Residue:501
BDBM50076719
NameBDBM50076719
Synonyms:CHEMBL1504752
TypeSmall organic molecule
Emp. Form.C22H28N6O3
Mol. Mass.424.4961
SMILESCCN1CCN(Cc2nc3n(C)c(=O)n(C)c(=O)c3n2CC(=O)c2ccccc2)CC1