Reaction Details
TargetAldehyde dehydrogenase 1A1
LigandBDBM50076742
Substrate/Competitorn/a
Meas. Tech.ChEMBL_1473980 (CHEMBL3419576)
IC50 57±n/a nM
Citation Morgan, CAHurley, TD Characterization of two distinct structural classes of selective aldehyde dehydrogenase 1A1 inhibitors. J Med Chem58:1964-75 (2015) 
 
Aldehyde dehydrogenase 1A1
Name:Aldehyde dehydrogenase 1A1
Type:Protein
Mol. Mass.:54862.21
Organism:Homo sapiens (Human)
Description:n/a
Residue:501
BDBM50076742
NameBDBM50076742
Synonyms:CHEBI:86194 | CHEMBL3416563
TypeSmall organic molecule
Emp. Form.C11H15NO
Mol. Mass.177.2429
SMILESCCN(CC)c1ccc(C=O)cc1